Silane, methoxy-

Phase change data

Data compiled by: William E. Acree, Jr., James S. Chickos

Enthalpy of vaporization

ΔvapH (kJ/mol) Temperature (K) Reference Comment
25.8201.Sternbach and MacDiarmid, 1961Based on data from 184. - 216. K.

Gas phase ion energetics data

Data compiled by: Sharon G. Lias, Rhoda D. Levin, and Sherif A. Kafafi

Ionization energy determinations

IE (eV) Method Reference Comment
10.61PEBock, Mollere, et al., 1973Vertical value

References

Sternbach and MacDiarmid, 1961
Sternbach, Burt; MacDiarmid, Alan G., The Preparation and Properties of Silyl Methyl Ether 1, J. Am. Chem. Soc., 1961, 83, 16, 3384-3388, https://doi.org/10.1021/ja01477a007 . [all data]