1-Methyl-5-phenyltetrazole

Condensed phase thermochemistry data

Data compiled by: Hussein Y. Afeefy, Joel F. Liebman, and Stephen E. Stein

Quantity Value Units Method Reference Comment
Δfsolid292.2 ± 1.3kJ/molCcbWilliams, McEwan, et al., 1957
Quantity Value Units Method Reference Comment
Δcsolid-4583.7 ± 1.3kJ/molCcbWilliams, McEwan, et al., 1957

References

Williams, McEwan, et al., 1957
Williams, M.M.; McEwan, W.S.; Henry, R.A., The heats of combustion of substituted triazoles, tetrazoles and related high nitrogen compounds, J. Phys. Chem., 1957, 61, 261-267. [all data]