Ethanone, 1-(2,4,5-trimethylphenyl)-

Gas phase thermochemistry data

Data compiled by: Hussein Y. Afeefy, Joel F. Liebman, and Stephen E. Stein

Quantity Value Units Method Reference Comment
Δfgas-189. ± 5.0kJ/molCcbBaker and Tweed, 1941Heat of formation derived by Cox and Pilcher, 1970

References

Baker and Tweed, 1941
Baker, J.W.; Tweed, W.T., Mechanism of aromatic side-chain reactions, with special reference to the polar effects of substituents. Part X. Physical and chemical evidence relating to the polar effect of o-methyl substituents in derivatives of the type C6H2Me3.CO.CH2R, J. Chem. Soc., 1941, 796-802. [all data]

Cox and Pilcher, 1970
Cox, J.D.; Pilcher, G., Thermochemistry of Organic and Organometallic Compounds, Academic Press, New York, 1970, 1-636. [all data]