cis-Bicyclo[3.3.0]-octan-2-one

Gas phase thermochemistry data

Data compiled by: Hussein Y. Afeefy, Joel F. Liebman, and Stephen E. Stein

Quantity Value Units Method Reference Comment
Δfgas-230. ± 5.4kJ/molCcbBarrett and Linstead, 1935Heat of formation derived by Cox and Pilcher, 1970

Condensed phase thermochemistry data

Data compiled by: Hussein Y. Afeefy, Joel F. Liebman, and Stephen E. Stein

Quantity Value Units Method Reference Comment
Δfliquid-68.0 ± 1.0kcal/molCcbBarrett and Linstead, 1935Heat of formation derived by Cox and Pilcher, 1970
Quantity Value Units Method Reference Comment
Δcliquid-1094.3 ± 1.1kcal/molCcbBarrett and Linstead, 1935Reanalyzed by Cox and Pilcher, 1970, Original value = -1094.1 ± 0.3 kcal/mol; Heat of formation derived by Cox and Pilcher, 1970; Corresponding Δfliquid = -68.00 kcal/mol (simple calculation by NIST; no Washburn corrections)

Phase change data

Data compiled by: Hussein Y. Afeefy, Joel F. Liebman, and Stephen E. Stein

Quantity Value Units Method Reference Comment
Δvap13.0 ± 0.5kcal/molVBarrett and Linstead, 1935Heat of formation derived by Cox and Pilcher, 1970

References

Barrett and Linstead, 1935
Barrett, J.W.; Linstead, R.P., Fused carbon rings. Part IV. Further investigation of 0:3:3-bicycloOctanones in relation to the strain theory, J. Chem. Soc., 1935, 436-442. [all data]

Cox and Pilcher, 1970
Cox, J.D.; Pilcher, G., Thermochemistry of Organic and Organometallic Compounds, Academic Press, New York, 1970, 1-636. [all data]