2,7-Dimethyl-2,7-octanediol
- Formula: C10H22O2
- Molecular weight: 174.2805
- IUPAC Standard InChIKey: LZMSJLJRUYKOQD-UHFFFAOYSA-N
- CAS Registry Number: 19781-07-8
- Chemical structure:
View 3d structure (requires JavaScript / HTML 5) - Other names: 2,7-Octanediol, 2,7-dimethyl-

Condensed phase thermochemistry data

Data compiled by: Hussein Y. Afeefy, Joel F. Liebman, and Stephen E. Stein
Quantity | Value | Units | Method | Reference | Comment |
---|---|---|---|---|---|
ΔfH°solid | -730. ± 2. | kJ/mol | Ccr | Zaikin, Nazaruk, et al., 1970 | |
Quantity | Value | Units | Method | Reference | Comment |
ΔcH°solid | -6349. ± 2. | kJ/mol | Ccr | Zaikin, Nazaruk, et al., 1970 | Corresponding ΔfHºsolid = -730.1 kJ/mol (simple calculation by NIST; no Washburn corrections) |

References

Zaikin, Nazaruk, et al., 1970
Zaikin, I.D.; Nazaruk, L.N.; Klim, N.I.; Yurzhenko, T.I.,
Standard heats of formation of some ditertiary glycoles containing two tertiary carbon atoms,
Izv. Vyssh. Uchebn. Zaved., Khim. Khim. Tekhnol., 1970, 13, 786. [all data]