4-Benzyl-2,5-oxazolidinedione

Condensed phase thermochemistry data

Data compiled by: Hussein Y. Afeefy, Joel F. Liebman, and Stephen E. Stein

Quantity Value Units Method Reference Comment
Δfsolid-552.4 ± 3.4kJ/molCcbBreitenbach, Derkosch, et al., 1952Reanalyzed by Cox and Pilcher, 1970, Original value = -550.2 kJ/mol
Quantity Value Units Method Reference Comment
Δcsolid-4668.9 ± 3.3kJ/molCcbBreitenbach, Derkosch, et al., 1952Reanalyzed by Cox and Pilcher, 1970, Original value = -4669.8 kJ/mol

References

Breitenbach, Derkosch, et al., 1952
Breitenbach, J.W.; Derkosch, J.; Wessely, F., Energetik der bildung hochmolekularer polypeptide, Monatsh. Chem., 1952, 83, 591. [all data]

Cox and Pilcher, 1970
Cox, J.D.; Pilcher, G., Thermochemistry of Organic and Organometallic Compounds, Academic Press, New York, 1970, 1-636. [all data]