Methyltris(trimethylsiloxy)silane

Phase change data

Data compiled by: William E. Acree, Jr., James S. Chickos

Enthalpy of vaporization

ΔvapH (kJ/mol) Temperature (K) Method Reference Comment
49.5377.EBFlaningam, 1986Based on data from 362. - 476. K.

References

Flaningam, 1986
Flaningam, Ora L., Vapor pressures of poly(dimethylsiloxane) oligomers, J. Chem. Eng. Data, 1986, 31, 3, 266-272, https://doi.org/10.1021/je00045a002 . [all data]