cis-1,2-Cyclohexanediol
- Formula: C6H12O2
- Molecular weight: 116.1583
- IUPAC Standard InChIKey: PFURGBBHAOXLIO-OLQVQODUSA-N
- CAS Registry Number: 1792-81-0
- Chemical structure:
View 3d structure (requires JavaScript / HTML 5) - Stereoisomers:
- Other names: cis-1,2-Dihydroxycyclohexane; Grandidentol; 1,2-Cyclohexanediol, cis-; 1,2-Cyclohexanediol, (Z)-

Phase change data

Data compiled as indicated in comments:
TRC - Thermodynamics Research Center, NIST Boulder Laboratories, Chris Muzny director
AC - William E. Acree, Jr., James S. Chickos
CAL - James S. Chickos, William E. Acree, Jr., Joel F. Liebman, Students of Chem 202 (Introduction to the Literature of Chemistry), University of Missouri -- St. Louis
Quantity | Value | Units | Method | Reference | Comment |
---|---|---|---|---|---|
Tfus | 371.15 | K | N/A | Milas and Sussman, 1937 | Uncertainty assigned by TRC = 1. K; TRC |
Enthalpy of sublimation
ΔsubH (kJ/mol) | Temperature (K) | Method | Reference | Comment |
---|---|---|---|---|
43.7 | 304. | ME | Stephenson and Malanowski, 1987 | Based on data from 289. to 320. K. See also Zibberman-Granovskaya, 1940.; AC |
Enthalpy of fusion
ΔfusH (kJ/mol) | Temperature (K) | Method | Reference | Comment |
---|---|---|---|---|
3.3 | 371.6 | N/A | Maria and Eusebio, 2008 | AC |
20.27 | 373.2 | DSC | Zhou, Peng, et al., 2002 | See also Zhou, Zhang, et al., 2003.; AC |
3.32 | 371.6 | N/A | Maria, Costa, et al., 1995 | AC |
Entropy of fusion
ΔfusS (J/mol*K) | Temperature (K) | Reference | Comment |
---|---|---|---|
55.19 | 360.4 | Maria, Costa, et al., 1995, 2 | CAL |
8.93 | 371.6 |

References

Milas and Sussman, 1937
Milas, N.A.; Sussman, S.,
The Hydroxylation of Unsaturated Substances. IV. The Catalytic Hydroxylation of Unsaturated Hydrocarbons,
J. Am. Chem. Soc., 1937, 59, 2345. [all data]
Stephenson and Malanowski, 1987
Stephenson, Richard M.; Malanowski, Stanislaw,
Handbook of the Thermodynamics of Organic Compounds, 1987, https://doi.org/10.1007/978-94-009-3173-2
. [all data]
Zibberman-Granovskaya, 1940
Zibberman-Granovskaya, A.A.,
Russ. J. Phys. Chem., 1940, 14, 759. [all data]
Maria and Eusebio, 2008
Maria, Teresa M.R.; Eusebio, M. Ermelinda S.,
Molar Heat Capacity of 1,2-Cyclohexanediol Isomers From (173 to 428) K,
J. Chem. Eng. Data, 2008, 53, 6, 1316-1320, https://doi.org/10.1021/je800047t
. [all data]
Zhou, Peng, et al., 2002
Zhou, C.-R.; Peng, G.-S.; Zhang, Y.-D.; Jiang, D.G.; Wang, F.; Li, J.-J.; Shen, X.-Q.,
Gaoxiao Huaxue Gongcheng Xuebao, 2002, 16, 3, 237. [all data]
Zhou, Zhang, et al., 2003
Zhou, C.; Zhang, Y.; Jiang, D.,
Chin. J. Chem. Eng., 2003, 11, 5, 598. [all data]
Maria, Costa, et al., 1995
Maria, Teresa M.R.; Costa, Felisbela S.; Leitão, M. Luísa P.; Redinha, J.S.,
A calorimetric study of phase transitions for some cyclohexanediols,
Thermochimica Acta, 1995, 269-270, 405-413, https://doi.org/10.1016/0040-6031(95)02704-1
. [all data]
Maria, Costa, et al., 1995, 2
Maria, T.M.R.; Costa, F.S.; Leitao, M.L.P.; Redinha, J.S.,
A calorimetric study of phase transitions for some cyclohexanediols,
Thermochim. Acta, 1995, 269-270, 405, https://doi.org/10.1016/0040-6031(95)02704-1
. [all data]