Perhydrotriquinacene
- Formula: C10H16
- Molecular weight: 136.2340
- IUPAC Standard InChIKey: MVMFUXACHPDDMY-UHFFFAOYSA-N
- CAS Registry Number: 17760-91-7
- Chemical structure:
View 3d structure (requires JavaScript / HTML 5) - Permanent link for this species. Use this link for bookmarking this species for future reference.

Phase change data

Data compiled as indicated in comments:
DRB - Donald R. Burgess, Jr.
ALS - Hussein Y. Afeefy, Joel F. Liebman, and Stephen E. Stein
AC - William E. Acree, Jr., James S. Chickos
Quantity | Value | Units | Method | Reference | Comment |
---|---|---|---|---|---|
ΔsubH° | 56.7 | kJ/mol | N/A | Clark, Knox, et al., 1979 | DRB |
Enthalpy of sublimation
ΔsubH (kJ/mol) | Temperature (K) | Method | Reference | Comment |
---|---|---|---|---|
56.6 ± 1.3 | 307. | V | Clark, Knox, et al., 1979 | see Clark, Knox, et al., 1975; ALS |
56.6 ± 1.3 | 307. | TSGC | Clark, Knox, et al., 1979 | AC |

Condensed phase thermochemistry data

Data compiled by: Hussein Y. Afeefy, Joel F. Liebman, and Stephen E. Stein
Quantity | Value | Units | Method | Reference | Comment |
---|---|---|---|---|---|
ΔfH°solid | -159.0 ± 3.2 | kJ/mol | Ccr | Clark, Knox, et al., 1979 | see Clark, Knox, et al., 1975 |
Quantity | Value | Units | Method | Reference | Comment |
ΔcH°solid | -6062.8 ± 3.2 | kJ/mol | Ccr | Clark, Knox, et al., 1979 | see Clark, Knox, et al., 1975; Corresponding ΔfHºsolid = -159.0 kJ/mol (simple calculation by NIST; no Washburn corrections) |

Reaction thermochemistry data

Data compiled by: Hussein Y. Afeefy, Joel F. Liebman, and Stephen E. Stein
Individual Reactions
2 + C10H12 =
By formula: 2H2 + C10H12 = C10H16
Quantity | Value | Units | Method | Reference | Comment |
---|---|---|---|---|---|
ΔrH° | -230. ± 2. | kJ/mol | Chyd | Liebman, Paquette, et al., 1986 | liquid phase; solvent: Hexane |
By formula: 3H2 + C10H10 = C10H16
Quantity | Value | Units | Method | Reference | Comment |
---|---|---|---|---|---|
ΔrH° | -326. ± 2. | kJ/mol | Chyd | Liebman, Paquette, et al., 1986 | liquid phase; solvent: Hexane |
By formula: H2 + C10H14 = C10H16
Quantity | Value | Units | Method | Reference | Comment |
---|---|---|---|---|---|
ΔrH° | -115. ± 1. | kJ/mol | Chyd | Liebman, Paquette, et al., 1986 | liquid phase; solvent: Hexane |

Gas phase thermochemistry data

Data compiled by: Hussein Y. Afeefy, Joel F. Liebman, and Stephen E. Stein
Quantity | Value | Units | Method | Reference | Comment |
---|---|---|---|---|---|
ΔfH°gas | -102.3 ± 3.6 | kJ/mol | Ccr | Clark, Knox, et al., 1979 | see Clark, Knox, et al., 1975 |

References

Clark, Knox, et al., 1979
Clark, T.; Knox, T.M.O.; McKervey, M.A.; Mackle, H.; Rooney, J.J.,
Thermochemistry of bridged-ring substances. Enthalpies of formation of some diamondoid hydrocarbons and of perhydroquinacene. Comparisons with data from empirical force field calculations,
J. Am. Chem. Soc., 1979, 101, 2404-2410. [all data]
Clark, Knox, et al., 1975
Clark, T.; Knox, T.M.; Mackle, H.; McKervey, M.A.,
Enthalpy of formation of perhydroquinacene and the strain energy of dodecahedrane,
J. Chem. Soc. Chem. Commun., 1975, 666-667. [all data]