α-L-Sorbofuranose, 2,3:4,6-bis-O-(1-methylethylidene)-

Condensed phase thermochemistry data

Data compiled by: Hussein Y. Afeefy, Joel F. Liebman, and Stephen E. Stein

Quantity Value Units Method Reference Comment
Δfsolid-1154.7 ± 2.8kJ/molCcbGerasimov, Blokh, et al., 1985
Quantity Value Units Method Reference Comment
Δcsolid-6425.7 ± 2.8kJ/molCcbGerasimov, Blokh, et al., 1985Corresponding Δfsolid = -1154.7 kJ/mol (simple calculation by NIST; no Washburn corrections)

References

Gerasimov, Blokh, et al., 1985
Gerasimov, P.A.; Blokh, E.L.; Gubareva, A.I., Standard heats of formation of intermediates in the synthesis of vitamin C, Izv. Vyssh. Uchebn. Zaved., Khim. Khim. Tekhnol., 1985, 28, 54-56. [all data]