1,2-Cyclohexanediol diacetate, trans-

Condensed phase thermochemistry data

Data compiled by: Hussein Y. Afeefy, Joel F. Liebman, and Stephen E. Stein

Quantity Value Units Method Reference Comment
Δcsolid-5287.3kJ/molCcbVerkade, Coops, et al., 1930At 15° C; Corresponding Δfsolid = -934.3 kJ/mol (simple calculation by NIST; no Washburn corrections)

References

Verkade, Coops, et al., 1930
Verkade, P.E.; Coops, J., Jr.; Verkade-Sandbergen, A., Calorimetrische Untersuchungen. XVII und XIX. Thermochemische Studien uber Cycloparaffine un ihre Derivate. XVII. Experimentelle Daten fur funf-und sechsgliedrige cyclische Diacetate., Ann., 1930, 477, 279-297. [all data]