Naphthalene, decahydro-1,6-dimethyl-

Phase change data

Data compiled by: Thermodynamics Research Center, NIST Boulder Laboratories, Chris Muzny director

Quantity Value Units Method Reference Comment
Tboil491.KN/AWeissenberger, Henke, et al., 1926Uncertainty assigned by TRC = 2. K

In addition to the Thermodynamics Research Center (TRC) data available from this site, much more physical and chemical property data is available from the following TRC products:

References

Weissenberger, Henke, et al., 1926
Weissenberger, G.; Henke, R.; Katschinka, H., Binary liquid mixtures: xx systems with substituting hydronaphthalenes, Z. Anorg. Allg. Chem., 1926, 153, 33. [all data]