Bicyclo[1.1.0]butane-1-carbonitrile
- Formula: C5H5N
- Molecular weight: 79.0999
- IUPAC Standard InChIKey: BPPMXXJOMACYJD-UHFFFAOYSA-N
- CAS Registry Number: 16955-35-4
- Chemical structure:
View 3d structure (requires JavaScript / HTML 5) - Permanent link for this species. Use this link for bookmarking this species for future reference.

Phase change data

Data compiled as indicated in comments:
ALS - Hussein Y. Afeefy, Joel F. Liebman, and Stephen E. Stein
DRB - Donald R. Burgess, Jr.
AC - William E. Acree, Jr., James S. Chickos
Quantity | Value | Units | Method | Reference | Comment |
---|---|---|---|---|---|
ΔvapH° | 45.73 | kJ/mol | V | Hall and Baldt, 1971 | ALS |
ΔvapH° | 45.7 | kJ/mol | N/A | Hall and Baldt, 1971 | DRB |
Enthalpy of vaporization
ΔvapH (kJ/mol) | Temperature (K) | Method | Reference | Comment |
---|---|---|---|---|
48.0 | 319. | BG | Baldt and Hall, 1971 | Based on data from 307. to 349. K.; AC |

Gas phase thermochemistry data

Data compiled by: Hussein Y. Afeefy, Joel F. Liebman, and Stephen E. Stein
Quantity | Value | Units | Method | Reference | Comment |
---|---|---|---|---|---|
ΔfH°gas | 304.5 | kJ/mol | Ccr | Hall and Baldt, 1971 |

References

Hall and Baldt, 1971
Hall, H.K., Jr.; Baldt, J.H.,
Thermochemistry of strained-ring bridgehead nitriles and esters,
J. Am. Chem. Soc., 1971, 93, 140-145. [all data]
Baldt and Hall, 1971
Baldt, J.H.; Hall, H.K.K., Jr.,
Thermochemistry of strained-ring bridgehead nitriles and esters,
J. Am. Chem. Soc., 1971, 93, 140-145. [all data]