2-Butanethiol, 2-methyl-

Gas phase thermochemistry data

Data compiled by: Hussein Y. Afeefy, Joel F. Liebman, and Stephen E. Stein

Quantity Value Units Method Reference Comment
Δfgas-126.9 ± 0.92kJ/molCcbScott, Douslin, et al., 1962

References

Scott, Douslin, et al., 1962
Scott, D.W.; Douslin, D.R.; Finke, H.L.; Hubbard, W.N.; Messerly, J.F.; Hossenlopp, I.A.; McCullough, J.P., 2-Methyl-2-butanethiol: Chemical thermodynamic properties and rotational isomerism, J. Phys. Chem., 1962, 66, 1334-1341. [all data]