1,1'-Spirobi[1H-indene]

Reaction thermochemistry data

Data compiled by: Hussein Y. Afeefy, Joel F. Liebman, and Stephen E. Stein

Individual Reactions

2Hydrogen + 1,1'-Spirobi[1H-indene] = 1,1'-Spirobiindane

By formula: 2H2 + C17H12 = C17H16

Quantity Value Units Method Reference Comment
Δr-61.0 ± 1.0kcal/molChydHill, Morton, et al., 1980liquid phase

References

Hill, Morton, et al., 1980
Hill, R.K.; Morton, G.H.; Rogers, D.W.; Choi, L.S., Rearrangement of 1,1'-spirobiindene and thermochemical evidence for its spiroconjugative destabilization, J. Org. Chem., 1980, 45, 5163-5166. [all data]