Pentane, 2,4-dichloro-, (R*,R*)-(±)-
- Formula: C5H10Cl2
- Molecular weight: 141.039
- IUPAC Standard InChIKey: DYGOBGYJRRKFEN-WHFBIAKZSA-N
- CAS Registry Number: 1625-67-8
- Chemical structure:
View 3d structure (requires JavaScript / HTML 5) - Stereoisomers:

Reaction thermochemistry data

Data compiled by: Hussein Y. Afeefy, Joel F. Liebman, and Stephen E. Stein
Individual Reactions
By formula: C5H10Cl2 = C5H10Cl2
Quantity | Value | Units | Method | Reference | Comment |
---|---|---|---|---|---|
ΔrH° | -2430. ± 290. | kJ/mol | Eqk | Cherkasova, Rozhnov, et al., 1976 | gas phase |

References

Cherkasova, Rozhnov, et al., 1976
Cherkasova, R.I.; Rozhnov, A.M.; Sharonov, K.G.,
Equilibrium of the isomerization of optical forms of 2,3- and 2,4-dichloropentanes,
Izv. Vyssh. Uchebn. Zaved., Khim. Khim. Tekhnol., 1976, 19, 15-17. [all data]