2(1H)-Naphthalenone, octahydro-, trans-

Reaction thermochemistry data

Data compiled by: Hussein Y. Afeefy, Joel F. Liebman, and Stephen E. Stein

Individual Reactions

2(1H)-Naphthalenone, octahydro-, trans- = cis-octahydronaphthalene-2(1H)-one

By formula: C10H16O = C10H16O

Quantity Value Units Method Reference Comment
Δr10.5 ± 1.3kJ/molEqkAllinger and Siefert, 1972liquid phase; At 488 K

References

Allinger and Siefert, 1972
Allinger, N.L.; Siefert, J.H., Conformational analysis. LXXXVI. The equilibrium between the cis and trans isomers of 2-decalone, J. Am. Chem. Soc., 1972, 94, 8082-8084. [all data]