1,1'-Biphenyl, 2,2',6,6'-tetrachloro-

Henry's Law data

Data compiled by: Rolf Sander

Henry's Law constant (water solution)

kH(T) = H exp(d(ln(kH))/d(1/T) ((1/T) - 1/(298.15 K)))
H = Henry's law constant for solubility in water at 298.15 K (mol/(kg*bar))
d(ln(kH))/d(1/T) = Temperature dependence constant (K)

H (mol/(kg*bar)) d(ln(kH))/d(1/T) (K) Method Reference Comment
1.8 MDunnivant, Coates, et al., 1988
0.53 XBurkhard, Armstrong, et al., 1985Value given here as quoted by Dunnivant, Coates, et al., 1988.
6.7 XN/AValue given here as quoted by Dunnivant, Coates, et al., 1988.

References

Dunnivant, Coates, et al., 1988
Dunnivant, F.M.; Coates, J.T.; Elzerman, A.W., Experimentally Determined Henry's Law Constants for 17 Polychlorobiphenyl Congeners, Environ. Sci. Technol., 1988, 22, 448-453. [all data]

Burkhard, Armstrong, et al., 1985
Burkhard, L.P.; Armstrong, D.E.; Andren, A.W., Henry's Law Constants for the Polychlorinated Biphenyls, Environ. Sci. Technol., 1985, 19, 590-596. [all data]