Cholest-2-ene
- Formula: C27H46
- Molecular weight: 370.6541
- IUPAC Standard InChIKey: UTGYMZAUDAYPOM-GJMZQSANSA-N
- CAS Registry Number: 15910-23-3
- Chemical structure:
View 3d structure (requires JavaScript / HTML 5) - Other names: 2-Cholestene

Reaction thermochemistry data

Data compiled by: Hussein Y. Afeefy, Joel F. Liebman, and Stephen E. Stein
Individual Reactions
By formula: H2 + C27H46 = C27H48
Quantity | Value | Units | Method | Reference | Comment |
---|---|---|---|---|---|
ΔrH° | -108.2 ± 0.71 | kJ/mol | Chyd | Turner, Meador, et al., 1957 | liquid phase; solvent: Acetic acid |

References

Turner, Meador, et al., 1957
Turner, R.B.; Meador, W.R.; Winkler, R.E.,
Heats of hydrogenation. II. Heats of hydrogenation and the acid-catalyzed isomerization of some unsaturated steroids,
J. Am. Chem. Soc., 1957, 79, 4122-4127. [all data]