Threo-3-methylpentan-2-ol
- Formula: C6H14O
- Molecular weight: 102.1748
- IUPAC Standard InChIKey: ZXNBBWHRUSXUFZ-PHDIDXHHSA-N
- CAS Registry Number: 1502-93-8
- Chemical structure:
View 3d structure (requires JavaScript / HTML 5) - Stereoisomers:

Reaction thermochemistry data

Data compiled by: Hussein Y. Afeefy, Joel F. Liebman, and Stephen E. Stein
Individual Reactions
=
By formula: C6H14O = C6H14O
Quantity | Value | Units | Method | Reference | Comment |
---|---|---|---|---|---|
ΔrH° | 0.2 ± 0.2 | kJ/mol | Eqk | Kabo and Frenkel, 1983 | gas phase |

References

Kabo and Frenkel, 1983
Kabo, G.J.; Frenkel, M.L.,
Thermodynamics of diastereomeric transformations of alcohols with different carbon-skeleton structures,
J. Chem. Thermodyn., 1983, 15, 377-381. [all data]