Bis(ditrifluoromethyldiphosphino) sulfide

Phase change data

Data compiled by: William E. Acree, Jr., James S. Chickos

Enthalpy of vaporization

ΔvapH (kJ/mol) Temperature (K) Method Reference Comment
42.2304.TCavell and Emel«65533»us, 1964Based on data from 273. - 335. K.

References

Cavell and Emel«65533»us, 1964
Cavell, R.G.; Emel«65533»us, H.J., 1110. Some bistrifluoromethylphosphino-derivatives of sulphur, J. Chem. Soc., 1964, 5825, https://doi.org/10.1039/jr9640005825 . [all data]