2-Ethylpiperidine
- Formula: C7H15N
- Molecular weight: 113.2007
- IUPAC Standard InChIKey: QBBKKFZGCDJDQK-UHFFFAOYSA-N
- CAS Registry Number: 1484-80-6
- Chemical structure:
View 3d structure (requires JavaScript / HTML 5) - Other names: α-Ethylpiperidine; Piperidine, 2-ethyl-

Phase change data

Data compiled as indicated in comments:
BS - Robert L. Brown and Stephen E. Stein
AC - William E. Acree, Jr., James S. Chickos
Quantity | Value | Units | Method | Reference | Comment |
---|---|---|---|---|---|
Tboil | 416.2 | K | N/A | Aldrich Chemical Company Inc., 1990 | BS |
Quantity | Value | Units | Method | Reference | Comment |
ΔvapH° | 42.2 ± 0.9 | kJ/mol | C | Ribeiro da Silva, Cabral, et al., 2006 | AC |

Normal alkane RI, non-polar column, custom temperature program

Column type | Active phase | I | Reference | Comment |
---|---|---|---|---|
Capillary | Methyl Silicone | 890. | Farkas, Héberger, et al., 2004 | Program: not specified |

References

Aldrich Chemical Company Inc., 1990
Aldrich Chemical Company Inc.,
Catalog Handbook of Fine Chemicals, Aldrich Chemical Company, Inc., Milwaukee WI, 1990, 1. [all data]
Ribeiro da Silva, Cabral, et al., 2006
Ribeiro da Silva, Manuel A.V.; Cabral, Joana I.T.A.; Gomes, José R.B.,
Experimental and computational study on the thermochemistry of ethylpiperidines,
The Journal of Chemical Thermodynamics, 2006, 38, 8, 1072-1078, https://doi.org/10.1016/j.jct.2005.11.004
. [all data]