2-[(o-nitrophenyl)azo]-p-cresol

Condensed phase thermochemistry data

Data compiled by: Hussein Y. Afeefy, Joel F. Liebman, and Stephen E. Stein

Quantity Value Units Method Reference Comment
Δfsolid47.5 ± 1.5kcal/molCcbVasil'ev and Volkov, 1996
Δfsolid47.5 ± 1.5kcal/molCcbVasil'ev and Volkov, 1996
Quantity Value Units Method Reference Comment
Δcsolid-1645.9 ± 1.4kcal/molCcbVasil'ev and Volkov, 1996
Δcsolid-1645.9 ± 1.4kcal/molCcbVasil'ev and Volkov, 1996

References

Vasil'ev and Volkov, 1996
Vasil'ev, V.P.; Volkov, A.V., Standard enthalpies of combustion and formation of 2(2-hydroxy-5-methylphenyl)-benzotriazole and 2-nitro(2-hydroxy-5-methylphenyl)-azobenzene, Russ. J. Phys. Chem. (Engl. Transl.), 1996, 70, 866-867, In original 931. [all data]