cyclopropyl butyl ketone

Phase change data

Data compiled by: Thermodynamics Research Center, NIST Boulder Laboratories, Chris Muzny director

Quantity Value Units Method Reference Comment
Tboil444.KN/ASlabey and Wise, 1952Uncertainty assigned by TRC = 2. K

In addition to the Thermodynamics Research Center (TRC) data available from this site, much more physical and chemical property data is available from the following TRC products:

References

Slabey and Wise, 1952
Slabey, V.A.; Wise, P.H., The Dehydration of Methylalkylcyclopropylcarbinols. Isolation and Purification of 2-Cyclopropylalkenes, J. Am. Chem. Soc., 1952, 74, 1473. [all data]