xenon tetrafluoride
- Formula: F4Xe
- Molecular weight: 207.287
- CAS Registry Number: 13709-61-0

Phase change data

Data compiled as indicated in comments:
TRC - Thermodynamics Research Center, NIST Boulder Laboratories, Chris Muzny director
AC - William E. Acree, Jr., James S. Chickos
Quantity | Value | Units | Method | Reference | Comment |
---|---|---|---|---|---|
Ttriple | 390.0 | K | N/A | Ogrin, Zemva, et al., 1972 | Uncertainty assigned by TRC = 0.5 K; TRC |
Quantity | Value | Units | Method | Reference | Comment |
Tc | 612. | K | N/A | Ogrin, Zemva, et al., 1972 | Uncertainty assigned by TRC = 1.5 K; TRC |
Quantity | Value | Units | Method | Reference | Comment |
Pc | 69.48 | atm | N/A | Ogrin, Zemva, et al., 1972 | Uncertainty assigned by TRC = 0.6999 atm; TRC |
Quantity | Value | Units | Method | Reference | Comment |
ρc | 5.307 | mol/l | N/A | Ogrin, Zemva, et al., 1972 | Uncertainty assigned by TRC = 0.072 mol/l; TRC |
Enthalpy of vaporization
ΔvapH (kcal/mol) | Temperature (K) | Reference | Comment |
---|---|---|---|
14.3 | 568. | House, 1983 | Based on data from 553. to 663. K.; AC |

References

Ogrin, Zemva, et al., 1972
Ogrin, T.; Zemva, B.; Bohinc, M.; slivnik, J.,
Critical constants and liquid densities of xenon difluoride and xenon tetrafluoride,
J. Chem. Eng. Data, 1972, 17, 418-9. [all data]
House, 1983
House, J.E.,
Cohesion energies and solubility parameters for xenon difluoride and xenon tetrafluoride,
Journal of Fluorine Chemistry, 1983, 22, 3, 299-303, https://doi.org/10.1016/S0022-1139(00)84959-3
. [all data]