2-Methyl-6-nitrobenzoic acid

Phase change data

Data compiled by: William E. Acree, Jr., James S. Chickos

Quantity Value Units Method Reference Comment
Δsub120.0 ± 2.2kJ/molMEMonte and Hillesheim, 2001

References

Monte and Hillesheim, 2001
Monte, Manuel J.S.; Hillesheim, Dorothea M., Thermodynamic study on the sublimation of six methylnitrobenzoic acids, The Journal of Chemical Thermodynamics, 2001, 33, 1, 103-112, https://doi.org/10.1006/jcht.2000.0729 . [all data]