4,10-dipropyltridecane

Phase change data

Data compiled by: Thermodynamics Research Center, NIST Boulder Laboratories, Chris Muzny director

Quantity Value Units Method Reference Comment
Tfus222.KN/ALanda, Vacek, et al., 1954Uncertainty assigned by TRC = 4. K

In addition to the Thermodynamics Research Center (TRC) data available from this site, much more physical and chemical property data is available from the following TRC products:

References

Landa, Vacek, et al., 1954
Landa, S.; Vacek, J.; Kiefmann, J.; Vlnaty, J.; Skazko, I.; Vodicka, P., Aliphatic Branched-chair Hydrocarbons, Chem. Listy, 1954, 48, 674-8. [all data]