Retinol, acetate

Condensed phase thermochemistry data

Data compiled by: Hussein Y. Afeefy, Joel F. Liebman, and Stephen E. Stein

Quantity Value Units Method Reference Comment
Δfsolid-1713.0 ± 6.0kJ/molCcbGerasimov, Blokh, et al., 1986
Quantity Value Units Method Reference Comment
Δcsolid-11517.7 ± 6.0kJ/molCcbGerasimov, Blokh, et al., 1986Corresponding Δfsolid = -1712.8 kJ/mol (simple calculation by NIST; no Washburn corrections)

Kovats' RI, non-polar column, isothermal

View large format table.

Column type Active phase Temperature (C) I Reference Comment
CapillaryDB-1240.2578.Furr, Clifford, et al., 199215. m/0.25 mm/0.25 μm, H2, He
CapillaryDB-1190.2531.Furr, Clifford, et al., 19925. m/0.25 mm/0.1 μm, H2, He
CapillaryDB-1240.2578.Furr, Zeng, et al., 199015. m/0.25 mm/0.25 μm
CapillaryDB-1190.2531.Furr, Zeng, et al., 19905. m/0.25 mm/0.1 μm

References

Gerasimov, Blokh, et al., 1986
Gerasimov, P.A.; Blokh, E.L.; Gubareva, A.I.; Gazhdiev, S.N., Standard heats of formation of intermediates of vitamin A, Termodin. Org. Soedin., 1986, 26-27. [all data]