Ferrocene, acetyl-

Condensed phase thermochemistry data

Data compiled by: Eugene S. Domalski and Elizabeth D. Hearing

Constant pressure heat capacity of solid

Cp,solid (J/mol*K) Temperature (K) Reference Comment
246.0298.Tomassetti, Curini, et al., 1981T = 293 to 353°C. Equation given.

References

Tomassetti, Curini, et al., 1981
Tomassetti, M.; Curini, R.; D'Ascenzo, G.; Ortaggi, G., Heat capacities of ferrocene, acetyl-, 1,1'-diacetyl-, benzoyl-, and 1,1'-dibenzoylferrocene by DSC, Thermochim. Acta, 1981, 48, 333-341. [all data]