Deuterium, deuteronated

Ion clustering data

Data compiled by: Michael M. Meot-Ner (Mautner) and Sharon G. Lias

Clustering reactions

D3+ + Argon = (D3+ • Argon)

By formula: D3+ + Ar = (D3+ • Ar)

Quantity Value Units Method Reference Comment
Δr29.1 ± 0.8kJ/molPHPMSHiraoka and Mori, 1989gas phase
Quantity Value Units Method Reference Comment
Δr60.7J/mol*KPHPMSHiraoka and Mori, 1989gas phase

(D3+ • Argon) + Argon = (D3+ • 2Argon)

By formula: (D3+ • Ar) + Ar = (D3+ • 2Ar)

Quantity Value Units Method Reference Comment
Δr20.1 ± 0.4kJ/molPHPMSHiraoka and Mori, 1989gas phase
Quantity Value Units Method Reference Comment
Δr73.2J/mol*KPHPMSHiraoka and Mori, 1989gas phase

(D3+ • 2Argon) + Argon = (D3+ • 3Argon)

By formula: (D3+ • 2Ar) + Ar = (D3+ • 3Ar)

Quantity Value Units Method Reference Comment
Δr18.6 ± 0.4kJ/molPHPMSHiraoka and Mori, 1989gas phase
Quantity Value Units Method Reference Comment
Δr77.0J/mol*KPHPMSHiraoka and Mori, 1989gas phase

(D3+ • 3Argon) + Argon = (D3+ • 4Argon)

By formula: (D3+ • 3Ar) + Ar = (D3+ • 4Ar)

Quantity Value Units Method Reference Comment
Δr10.2 ± 0.4kJ/molPHPMSHiraoka and Mori, 1989gas phase
Quantity Value Units Method Reference Comment
Δr69.5J/mol*KPHPMSHiraoka and Mori, 1989gas phase

(D3+ • 4Argon) + Argon = (D3+ • 5Argon)

By formula: (D3+ • 4Ar) + Ar = (D3+ • 5Ar)

Quantity Value Units Method Reference Comment
Δr9.5 ± 0.4kJ/molPHPMSHiraoka and Mori, 1989gas phase
Quantity Value Units Method Reference Comment
Δr72.8J/mol*KPHPMSHiraoka and Mori, 1989gas phase

(D3+ • 5Argon) + Argon = (D3+ • 6Argon)

By formula: (D3+ • 5Ar) + Ar = (D3+ • 6Ar)

Quantity Value Units Method Reference Comment
Δr9.1 ± 0.4kJ/molPHPMSHiraoka and Mori, 1989gas phase
Quantity Value Units Method Reference Comment
Δr79.9J/mol*KPHPMSHiraoka and Mori, 1989gas phase

(D3+ • 6Argon) + Argon = (D3+ • 7Argon)

By formula: (D3+ • 6Ar) + Ar = (D3+ • 7Ar)

Quantity Value Units Method Reference Comment
Δr6.5 ± 0.4kJ/molPHPMSHiraoka and Mori, 1989gas phase
Quantity Value Units Method Reference Comment
Δr105.J/mol*KPHPMSHiraoka and Mori, 1989gas phase

D3+ + Deuterium = (D3+ • Deuterium)

By formula: D3+ + D2 = (D3+ • D2)

Quantity Value Units Method Reference Comment
Δr30. ± 1.kJ/molPHPMSHiraoka and Mori, 1989, 2gas phase
Quantity Value Units Method Reference Comment
Δr78.7J/mol*KPHPMSHiraoka and Mori, 1989, 2gas phase

(D3+ • Deuterium) + Deuterium = (D3+ • 2Deuterium)

By formula: (D3+ • D2) + D2 = (D3+ • 2D2)

Quantity Value Units Method Reference Comment
Δr14.6 ± 0.8kJ/molPHPMSHiraoka and Mori, 1989, 2gas phase
Quantity Value Units Method Reference Comment
Δr74.9J/mol*KPHPMSHiraoka and Mori, 1989, 2gas phase

(D3+ • 2Deuterium) + Deuterium = (D3+ • 3Deuterium)

By formula: (D3+ • 2D2) + D2 = (D3+ • 3D2)

Quantity Value Units Method Reference Comment
Δr14.0 ± 0.8kJ/molPHPMSHiraoka and Mori, 1989, 2gas phase
Quantity Value Units Method Reference Comment
Δr83.7J/mol*KPHPMSHiraoka and Mori, 1989, 2gas phase

(D3+ • 3Deuterium) + Deuterium = (D3+ • 4Deuterium)

By formula: (D3+ • 3D2) + D2 = (D3+ • 4D2)

Quantity Value Units Method Reference Comment
Δr7.7 ± 0.4kJ/molPHPMSHiraoka and Mori, 1989, 2gas phase
Quantity Value Units Method Reference Comment
Δr76.1J/mol*KPHPMSHiraoka and Mori, 1989, 2gas phase

(D3+ • 4Deuterium) + Deuterium = (D3+ • 5Deuterium)

By formula: (D3+ • 4D2) + D2 = (D3+ • 5D2)

Quantity Value Units Method Reference Comment
Δr7.6 ± 0.4kJ/molPHPMSHiraoka and Mori, 1989, 2gas phase
Quantity Value Units Method Reference Comment
Δr79.9J/mol*KPHPMSHiraoka and Mori, 1989, 2gas phase

(D3+ • 5Deuterium) + Deuterium = (D3+ • 6Deuterium)

By formula: (D3+ • 5D2) + D2 = (D3+ • 6D2)

Quantity Value Units Method Reference Comment
Δr7.3 ± 0.4kJ/molPHPMSHiraoka and Mori, 1989, 2gas phase
Quantity Value Units Method Reference Comment
Δr91.2J/mol*KPHPMSHiraoka and Mori, 1989, 2gas phase

(D3+ • 6Deuterium) + Deuterium = (D3+ • 7Deuterium)

By formula: (D3+ • 6D2) + D2 = (D3+ • 7D2)

Quantity Value Units Method Reference Comment
Δr3.8 ± 0.4kJ/molPHPMSHiraoka and Mori, 1989, 2gas phase
Quantity Value Units Method Reference Comment
Δr53.6J/mol*KPHPMSHiraoka and Mori, 1989, 2gas phase

(D3+ • 7Deuterium) + Deuterium = (D3+ • 8Deuterium)

By formula: (D3+ • 7D2) + D2 = (D3+ • 8D2)

Quantity Value Units Method Reference Comment
Δr3.4 ± 0.4kJ/molPHPMSHiraoka and Mori, 1989, 2gas phase
Quantity Value Units Method Reference Comment
Δr64.0J/mol*KPHPMSHiraoka and Mori, 1989, 2gas phase

(D3+ • 8Deuterium) + Deuterium = (D3+ • 9Deuterium)

By formula: (D3+ • 8D2) + D2 = (D3+ • 9D2)

Quantity Value Units Method Reference Comment
Δr3.0 ± 0.4kJ/molPHPMSHiraoka and Mori, 1989, 2gas phase
Quantity Value Units Method Reference Comment
Δr81.2J/mol*KPHPMSHiraoka and Mori, 1989, 2gas phase

(D3+ • 9Deuterium) + Deuterium = (D3+ • 10Deuterium)

By formula: (D3+ • 9D2) + D2 = (D3+ • 10D2)

Quantity Value Units Method Reference Comment
Δr3.kJ/molPHPMSHiraoka and Mori, 1989, 2gas phase; Entropy change calculated or estimated
Quantity Value Units Method Reference Comment
Δr84.J/mol*KN/AHiraoka and Mori, 1989, 2gas phase; Entropy change calculated or estimated

References

Hiraoka and Mori, 1989
Hiraoka, K.; Mori, T., Isotope Effect and Nature of Bonding in the Cluster Ions H3+(Ar)n and D3+(Ar)n, J. Chem. Phys., 1989, 91, 8, 4821, https://doi.org/10.1063/1.456720 . [all data]

Hiraoka and Mori, 1989, 2
Hiraoka, K.; Mori, T., Thermochemical Stabilities of D3+(D2)n with n = 1 - 10, Chem. Phys. Lett., 1989, 157, 5, 467, https://doi.org/10.1016/0009-2614(89)87282-3 . [all data]