Hexanal, 2-ethyl-

Phase change data

Data compiled as indicated in comments:
TRC - Thermodynamics Research Center, NIST Boulder Laboratories, Chris Muzny director
BS - Robert L. Brown and Stephen E. Stein

Quantity Value Units Method Reference Comment
Tboil433.15KN/AKomarewsky and Kritchevsky, 1943Uncertainty assigned by TRC = 2. K; TRC
Tboil434.65KN/APowell and Baldwin, 1936Uncertainty assigned by TRC = 3. K; TRC

Reduced pressure boiling point

Tboil (K) Pressure (bar) Reference Comment
328.20.017Aldrich Chemical Company Inc., 1990BS

In addition to the Thermodynamics Research Center (TRC) data available from this site, much more physical and chemical property data is available from the following TRC products:

Condensed phase thermochemistry data

Data compiled by: Hussein Y. Afeefy, Joel F. Liebman, and Stephen E. Stein

Quantity Value Units Method Reference Comment
Δfliquid-348.6 ± 0.75kJ/molCcbTjebbes, 1960
Quantity Value Units Method Reference Comment
Δcliquid-5086.20 ± 0.75kJ/molCcbTjebbes, 1960Corresponding Δfliquid = -348.5 kJ/mol (simple calculation by NIST; no Washburn corrections)

Kovats' RI, non-polar column, isothermal

View large format table.

Column type Active phase Temperature (C) I Reference Comment
CapillaryHP-1110.940.Héberger and Görgényi, 199950. m/0.32 mm/1.05 μm, N2
CapillaryHP-150.933.Héberger and Görgényi, 199950. m/0.32 mm/1.05 μm, N2
CapillaryHP-170.935.Héberger and Görgényi, 199950. m/0.32 mm/1.05 μm, N2
CapillaryHP-190.938.Héberger and Görgényi, 199950. m/0.32 mm/1.05 μm, N2
PackedApiezon L120.926.Bogoslovsky, Anvaer, et al., 1978Celite 545
PackedApiezon L160.941.Bogoslovsky, Anvaer, et al., 1978Celite 545

Kovats' RI, polar column, isothermal

View large format table.

Column type Active phase Temperature (C) I Reference Comment
CapillaryHP-Innowax110.1220.6Héberger and Görgényi, 199930. m/0.32 mm/0.5 μm
CapillaryHP-Innowax50.1197.8Héberger and Görgényi, 199930. m/0.32 mm/0.5 μm
CapillaryHP-Innowax70.1205.9Héberger and Görgényi, 199930. m/0.32 mm/0.5 μm
CapillaryHP-Innowax90.1213.1Héberger and Görgényi, 199930. m/0.32 mm/0.5 μm

Van Den Dool and Kratz RI, non-polar column, temperature ramp

View large format table.

Column type Active phase I Reference Comment
CapillaryCP-Sil 8CB-MS956.Hierro, de la Hoz, et al., 200460. m/0.25 mm/0.25 μm, 40. C @ 2. min, 4. K/min, 280. C @ 5. min
CapillaryDB-5954.5Xu, van Stee, et al., 200330. m/0.25 mm/1. μm, He, 2.5 K/min; Tstart: 50. C; Tend: 200. C

Van Den Dool and Kratz RI, non-polar column, custom temperature program

View large format table.

Column type Active phase I Reference Comment
CapillaryBPX-5963.Elmore, Mottram, et al., 199750. m/0.32 mm/0.5 μm, He; Program: 0C (10min) => 40C/min => 40C (2min) => 4C/min => 280C

Normal alkane RI, non-polar column, isothermal

View large format table.

Column type Active phase Temperature (C) I Reference Comment
CapillaryOV-160.933.Amboni, Junkes, et al., 2002

Normal alkane RI, non-polar column, temperature ramp

View large format table.

Column type Active phase I Reference Comment
CapillaryOV-101959.Anker, Jurs, et al., 19902. K/min; Column length: 50. m; Column diameter: 0.28 mm; Tstart: 80. C; Tend: 200. C

Normal alkane RI, non-polar column, custom temperature program

View large format table.

Column type Active phase I Reference Comment
CapillaryHP-1933.Junkes, Amboni, et al., 2004Program: not specified
CapillarySE-30959.Vinogradov, 2004Program: not specified
CapillaryPolydimethyl siloxane933.Junkes, Castanho, et al., 2003Program: not specified
CapillaryOV-1, SE-30, Methyl silicone, SP-2100, OV-101, DB-1, etc.932.Waggott and Davies, 1984Hydrogen; Column length: 50. m; Column diameter: 0.32 mm; Program: not specified

Normal alkane RI, polar column, temperature ramp

View large format table.

Column type Active phase I Reference Comment
CapillaryCarbowax 20M1216.Anker, Jurs, et al., 19902. K/min; Column length: 80. m; Column diameter: 0.2 mm; Tstart: 70. C; Tend: 170. C

Normal alkane RI, polar column, custom temperature program

View large format table.

Column type Active phase I Reference Comment
CapillaryInnowax1198.Junkes, Amboni, et al., 2004Program: not specified
CapillaryCarbowax 20M1216.Vinogradov, 2004Program: not specified

References

Komarewsky and Kritchevsky, 1943
Komarewsky, V.I.; Kritchevsky, T.H., Synthesis of Olefin Hydrocarbons by Catalytic Condensation and Dehydration of Aliphatic Aldehydes, J. Am. Chem. Soc., 1943, 65, 547-8. [all data]

Powell and Baldwin, 1936
Powell, S.G.; Baldwin, M.M., The Condensation of 2-Butanone with Aldehydes of the Type RR'CHCHO, J. Am. Chem. Soc., 1936, 58, 1871. [all data]

Aldrich Chemical Company Inc., 1990
Aldrich Chemical Company Inc., Catalog Handbook of Fine Chemicals, Aldrich Chemical Company, Inc., Milwaukee WI, 1990, 1. [all data]