Ethynesulfenic acid

Gas phase thermochemistry data

Data compiled by: Hussein Y. Afeefy, Joel F. Liebman, and Stephen E. Stein

Quantity Value Units Method Reference Comment
Δfgas102.kJ/molIonTurecek, Brabec, et al., 1988

References

Turecek, Brabec, et al., 1988
Turecek, F.; Brabec, L.; Vondrak, t.; Hanus, V.; Hajicek, J.; Havlas, Z., Sulfenic acids in the gas phase. Preparation, ionization energies and heats of formation of methane-, ethene-, ethyne- and benzenesulfenic acid, Collect. Czech. Chem. Commun., 1988, 53, 2140-2158. [all data]