Dexamethasone-21-acetate

Phase change data

Data compiled by: William E. Acree, Jr., James S. Chickos

Enthalpy of fusion

ΔfusH (kJ/mol) Temperature (K) Reference
37.72503.Regosz, Chmielewska, et al., 1994

References

Regosz, Chmielewska, et al., 1994
Regosz, A.; Chmielewska, A.; Pelplinska, T.; Kowalski, P., Prediction of the solubility of steroid hormones, Pharmazie, 1994, 49, 5, 371. [all data]