Endosulfan

Phase change data

Data compiled by: William E. Acree, Jr., James S. Chickos

Enthalpy of fusion

ΔfusH (kJ/mol) Temperature (K) Method Reference
16.52368.DSCRodante, Vecchio, et al., 2000

References

Rodante, Vecchio, et al., 2000
Rodante, F.; Vecchio, S.; Catalani, G.; Guidotti, M., Journal of Thermal Analysis and Calorimetry, 2000, 60, 2, 605-622, https://doi.org/10.1023/A:1010159424733 . [all data]