2-Naphthalenol, 5,6,7,8-tetrahydro-

Phase change data

Data compiled as indicated in comments:
BS - Robert L. Brown and Stephen E. Stein
TRC - Thermodynamics Research Center, NIST Boulder Laboratories, Chris Muzny director

Quantity Value Units Method Reference Comment
Tboil548.7KN/AWeast and Grasselli, 1989BS
Quantity Value Units Method Reference Comment
Tfus333.KN/ABrown, Durand, et al., 1936Uncertainty assigned by TRC = 3. K; TRC

In addition to the Thermodynamics Research Center (TRC) data available from this site, much more physical and chemical property data is available from the following TRC products:

References

Weast and Grasselli, 1989
CRC Handbook of Data on Organic Compounds, 2nd Editon, Weast,R.C and Grasselli, J.G., ed(s)., CRC Press, Inc., Boca Raton, FL, 1989, 1. [all data]

Brown, Durand, et al., 1936
Brown, J.H.; Durand, H.W.; Marvel, C.S., The Reduction of Aromatic Compounds with Hydrogen and a Platinum Oxide- Platinum Black Catalysis in the Presence of Halogen Acid, J. Am. Chem. Soc., 1936, 58, 1594. [all data]