C23H32OSi

Reaction thermochemistry data

Data compiled by: John E. Bartmess

Individual Reactions

C23H31OSi- + Hydrogen cation = C23H32OSi

By formula: C23H31OSi- + H+ = C23H32OSi

Quantity Value Units Method Reference Comment
Δr1427. ± 10.kJ/molG+TSMishima, Mustanir, et al., 2000gas phase; Keto acidity: 323 K
Quantity Value Units Method Reference Comment
Δr1397. ± 8.4kJ/molIMREMishima, Mustanir, et al., 2000gas phase; Keto acidity: 323 K

References

Mishima, Mustanir, et al., 2000
Mishima, M.; Mustanir; Eventova, I.; Rappoport, Z., Acidities and pK(Enol) values of stable simple enols in the gas phase, J. Chem. Soc. Perkin Trans., 2000, 2, 7, 1505-1512, https://doi.org/10.1039/b001155j . [all data]