Benzene, 1,4-dibromo-2,5-dimethyl-
- Formula: C8H8Br2
- Molecular weight: 263.957
- IUPAC Standard InChIKey: QENIALCDPFDFHX-UHFFFAOYSA-N
- CAS Registry Number: 1074-24-4
- Chemical structure:
View 3d structure (requires JavaScript / HTML 5) - Other names: 1,4-Dibromo-2,5-dimethylbenzene; 2,5-Dibromo-1,4-dimethylbenzene; 2,5-Dibromo-p-xylene; 2,5-Dimethyl-1,4-dibromobenzene; p-Xylene, 2,5-dibromo-

Phase change data

Data compiled by: Robert L. Brown and Stephen E. Stein
Quantity | Value | Units | Method | Reference | Comment |
---|---|---|---|---|---|
Tboil | 534.2 | K | N/A | Weast and Grasselli, 1989 |
Reduced pressure boiling point
Tboil (K) | Pressure (bar) | Reference |
---|---|---|
423.2 | 0.028 | Weast and Grasselli, 1989 |

References

Weast and Grasselli, 1989
CRC Handbook of Data on Organic Compounds, 2nd Editon, Weast,R.C and Grasselli, J.G., ed(s)., CRC Press, Inc., Boca Raton, FL, 1989, 1. [all data]