3-Methyl-4-phenylfurazan

Condensed phase thermochemistry data

Data compiled by: Hussein Y. Afeefy, Joel F. Liebman, and Stephen E. Stein

Quantity Value Units Method Reference Comment
Δcsolid-4872.7 ± 5.0kJ/molCcbMilone and Allavena, 1931Reanalyzed by Cox and Pilcher, 1970, Original value = -4874. kJ/mol

References

Milone and Allavena, 1931
Milone, M.; Allavena, S., Sul calore di combustione di alcuni composti eterociclici, Gazz. Chim. Ital., 1931, 61, 75-90. [all data]

Cox and Pilcher, 1970
Cox, J.D.; Pilcher, G., Thermochemistry of Organic and Organometallic Compounds, Academic Press, New York, 1970, 1-636. [all data]