3-Hexyn-1-ol
- Formula: C6H10O
- Molecular weight: 98.1430
- IUPAC Standard InChIKey: ODEHKVYXWLXRRR-UHFFFAOYSA-N
- CAS Registry Number: 1002-28-4
- Chemical structure:
View 3d structure (requires JavaScript / HTML 5) - Other names: 3-Hexynol; 3-Hexyne-1-ol; hex-3-yn-1-ol

Phase change data

Data compiled by: Robert L. Brown and Stephen E. Stein
Quantity | Value | Units | Method | Reference | Comment |
---|---|---|---|---|---|
Tboil | 413. to 414. | K | N/A | Farchan Laboratories, 1990 |
Reduced pressure boiling point
Tboil (K) | Pressure (bar) | Reference |
---|---|---|
336.7 | 0.016 | Aldrich Chemical Company Inc., 1990 |

References

Farchan Laboratories, 1990
Farchan Laboratories,
Research Chemicals Catalog, Farchan Laboratories, Gainesville, FL, 1990, 91. [all data]
Aldrich Chemical Company Inc., 1990
Aldrich Chemical Company Inc.,
Catalog Handbook of Fine Chemicals, Aldrich Chemical Company, Inc., Milwaukee WI, 1990, 1. [all data]