selenium anion

Reaction thermochemistry data

Data compiled by: John E. Bartmess

Individual Reactions

Se- + Hydrogen cation = Selenium monohydride

By formula: Se- + H+ = HSe

Quantity Value Units Method Reference Comment
Δr1422. ± 4.6kJ/molD-EAVandevraye, Drag, et al., 2012gas phase; Given: 2.0206046(11) eV
Quantity Value Units Method Reference Comment
Δr1397. ± 5.0kJ/molH-TSVandevraye, Drag, et al., 2012gas phase; Given: 2.0206046(11) eV

References

Vandevraye, Drag, et al., 2012
Vandevraye, M.; Drag, C.; Blondel, C., Electron affinity of selenium measured by photodetachment microscopy, Phys. Rev. A, 2012, 85, 1, 015401, https://doi.org/10.1103/PhysRevA.85.015401 . [all data]