(CF3)3CH..Cl anion

Ion clustering data

Data compiled by: John E. Bartmess

Clustering reactions

Chlorine anion = C4HClF9-

By formula: Cl- = C4HClF9-

Quantity Value Units Method Reference Comment
Δr15.50 ± 0.30kcal/molIMREGuerrero, Herrero, et al., 2009gas phase

References

Guerrero, Herrero, et al., 2009
Guerrero, A.; Herrero, R.; Davalos, J.Z.; Koppel, I.; Abboud, J.L.M.; Chana, A.; Koppel, I.A., Hydrogen-Bonding Interactions of (CF3)(3)CH and (CF3)(3)C- in the Gas Phase. An Experimental (FT-ICR) and Computational Study, J. Phys. Chem. A, 2009, 113, 23, 6422-6429, https://doi.org/10.1021/jp811057m . [all data]