CF3CF=CF2..Br anion
- Formula: C3BrF6-
- Molecular weight: 229.927

Ion clustering data

Data compiled by: John E. Bartmess
Clustering reactions
By formula: Br- + C3F6 = C3BrF6-
Quantity | Value | Units | Method | Reference | Comment |
---|---|---|---|---|---|
ΔrH° | 9.90 ± 0.30 | kcal/mol | TDAs | Hiraoka, Takao, et al., 2002 | gas phase |
Quantity | Value | Units | Method | Reference | Comment |
ΔrG° | 4.24 ± 0.30 | kcal/mol | TDAs | Hiraoka, Takao, et al., 2002 | gas phase |
C3BrF6- + 2 = C6BrF12-
By formula: C3BrF6- + 2C3F6 = C6BrF12-
Quantity | Value | Units | Method | Reference | Comment |
---|---|---|---|---|---|
ΔrH° | 8.30 ± 0.30 | kcal/mol | TDAs | Hiraoka, Takao, et al., 2002 | gas phase |
Quantity | Value | Units | Method | Reference | Comment |
ΔrG° | 1.74 ± 0.30 | kcal/mol | TDAs | Hiraoka, Takao, et al., 2002 | gas phase |

Reaction thermochemistry data

Data compiled by: John E. Bartmess

Individual Reactions

Bromine anion + Propene, hexafluoro- = C3BrF6-

By formula: Br- + C3F6 = C3BrF6-

Quantity Value Units Method Reference Comment
Δr9.90 ± 0.30kcal/molTDAsHiraoka, Takao, et al., 2002gas phase
Quantity Value Units Method Reference Comment
Δr4.24 ± 0.30kcal/molTDAsHiraoka, Takao, et al., 2002gas phase

C3BrF6- + 2Propene, hexafluoro- = C6BrF12-

By formula: C3BrF6- + 2C3F6 = C6BrF12-

Quantity Value Units Method Reference Comment
Δr8.30 ± 0.30kcal/molTDAsHiraoka, Takao, et al., 2002gas phase
Quantity Value Units Method Reference Comment
Δr1.74 ± 0.30kcal/molTDAsHiraoka, Takao, et al., 2002gas phase

References

Hiraoka, Takao, et al., 2002
Hiraoka, K.; Takao, K.; Lino, T.; Nakagawa, F.; Suyama, H.; Mizuno, T.; Yamabe, S.,
Gas-phase ion-molecule reactions in C3F6,
J. Phys. Chem. A, 2002, 106, 4, 603-611, https://doi.org/10.1021/jp0116306
. [all data]