H2O..C6F6 radical anion

Reaction thermochemistry data

Data compiled by: John E. Bartmess

Individual Reactions

C6F6- + Water = C6H2F6O-

By formula: C6F6- + H2O = C6H2F6O-

Quantity Value Units Method Reference Comment
Δr22.2kJ/molN/AEustis, Wang, et al., 2007gas phase; Vertical Detachment Energy: 1.78±0.02 eV. EA is not adiabatic, just threshhold

C6H2F6O- + 2Water = C6H4F6O2-

By formula: C6H2F6O- + 2H2O = C6H4F6O2-

Quantity Value Units Method Reference Comment
Δr14.5kJ/molN/AEustis, Wang, et al., 2007gas phase; Vertical Detachment Energy: 1.93±0.03 eV. EA is not adiabatic, just threshhold

References

Eustis, Wang, et al., 2007
Eustis, S.N.; Wang, D.; Bowen, K.H.; Patwari, G.N., Photoelectron spectroscopy of hydrated hexafluorobenzene anions, J. Chem. Phys., 2007, 127, 11, 114312, https://doi.org/10.1063/1.2768349 . [all data]