cis-1,4-cyclohexandiolate anion
- Formula: C6H11O2-
- Molecular weight: 115.1509

Gas phase ion energetics data

Data compiled by: John E. Bartmess
Protonation reactions
By formula: C6H11O2- + H+ = C6H12O2
Quantity | Value | Units | Method | Reference | Comment |
---|---|---|---|---|---|
ΔrG° | 1490. ± 8.4 | kJ/mol | IMRE | Chen, Walthall, et al., 2004 | gas phase |

Reaction thermochemistry data

Data compiled by: John E. Bartmess
Individual Reactions
By formula: C6H11O2- + H+ = C6H12O2
Quantity | Value | Units | Method | Reference | Comment |
---|---|---|---|---|---|
ΔrG° | 1490. ± 8.4 | kJ/mol | IMRE | Chen, Walthall, et al., 2004 | gas phase |

References

Chen, Walthall, et al., 2004
Chen, X.; Walthall, D.A.; Brauman, J.I.,
Acidities in cyclohexanediols enhanced by intramolecular hydrogen bonds,
J. Am. Chem. Soc., 2004, 126, 39, 12614-12620, https://doi.org/10.1021/ja049780s
. [all data]