2,3,6-triCl-phenide anion

Gas phase ion energetics data

Data compiled by: John E. Bartmess

Protonation reactions

C6H2Cl3- + Hydrogen cation = Benzene, 1,2,4-trichloro-

By formula: C6H2Cl3- + H+ = C6H3Cl3

Quantity Value Units Method Reference Comment
Δr1549. ± 8.8kJ/molG+TSSchlosser, Marzi, et al., 2001gas phase; Acid: 1,2,4-trichlorobenzene. Anion assigned based on ab initio calculations.
Quantity Value Units Method Reference Comment
Δr1517. ± 8.4kJ/molIMRESchlosser, Marzi, et al., 2001gas phase; Acid: 1,2,4-trichlorobenzene. Anion assigned based on ab initio calculations.

References

Schlosser, Marzi, et al., 2001
Schlosser, M.; Marzi, E.; Cottet, F.; Buker, H.H.; Nibbering, N.M.M., The acidity of chloro-substituted benzenes: A comparison of gas phase, ab initio, and kinetic data, Chem. Eur. J., 2001, 7, 16, 3511-3516, https://doi.org/10.1002/1521-3765(20010817)7:16<3511::AID-CHEM3511>3.0.CO;2-U . [all data]