CH4..Br anion
- Formula: CH4Br-
- Molecular weight: 95.947

Gas phase thermochemistry data

Data compiled by: John E. Bartmess
Quantity | Value | Units | Method | Reference | Comment |
---|---|---|---|---|---|
ΔfH°gas | -71.74 | kcal/mol | Ther | Hiraoka, Mizuno, et al., 2001 |

Reaction thermochemistry data

Data compiled by: John E. Bartmess

Individual Reactions

Bromine anion + Methane = CH4Br-

By formula: Br- + CH4 = CH4Br-

Quantity Value Units Method Reference Comment
Δr3.10kcal/molN/AHiraoka, Mizuno, et al., 2001gas phase
Quantity Value Units Method Reference Comment
Δr-2.27kcal/molTDAsHiraoka, Mizuno, et al., 2001gas phase

Ion clustering data

Data compiled by: John E. Bartmess

Clustering reactions

Bromine anion + Methane = CH4Br-

By formula: Br- + CH4 = CH4Br-

Quantity Value Units Method Reference Comment
Δr3.10kcal/molN/AHiraoka, Mizuno, et al., 2001gas phase
Quantity Value Units Method Reference Comment
Δr-2.27kcal/molTDAsHiraoka, Mizuno, et al., 2001gas phase

References

Hiraoka, Mizuno, et al., 2001
Hiraoka, K.; Mizuno, T.; Iino, T.; Eguchi, D.; Yamabe, S.,
Characteristic changes of bond energies for gas-phase cluster ions of halide ions with methane and chloromethanes,
J. Phys. Chem. A, 2001, 105, 20, 4887-4893, https://doi.org/10.1021/jp010143n
. [all data]