MeOH..tBuCðC anion
- Formula: C7H13O-
- Molecular weight: 113.1781

Gas phase thermochemistry data

Data compiled by: John E. Bartmess
Quantity | Value | Units | Method | Reference | Comment |
---|---|---|---|---|---|
ΔfH°gas | -131. ± 13. | kJ/mol | Ther | Chabinyc and Brauman, 1999 | Anchored to MeOH ΔGacid=375.2 |

Reaction thermochemistry data

Data compiled by: John E. Bartmess
Individual Reactions
C6H9- + = C7H13O-
By formula: C6H9- + CH4O = C7H13O-
Quantity | Value | Units | Method | Reference | Comment |
---|---|---|---|---|---|
ΔrH° | 20.8 ± 2.0 | kcal/mol | IMRE | Chabinyc and Brauman, 1999 | gas phase; Anchored to MeOH ΔGacid=375.2 |
Quantity | Value | Units | Method | Reference | Comment |
ΔrG° | 11.50 | kcal/mol | IMRE | Mustanir, Matsuoka, et al., 2006 | gas phase |
ΔrG° | 10.7 ± 2.0 | kcal/mol | IMRE | Chabinyc and Brauman, 1999 | gas phase; Anchored to MeOH ΔGacid=375.2 |

References

Chabinyc and Brauman, 1999
Chabinyc, M.L.; Brauman, J.I.,
Hydrogen bond strength and acidity. Structural and energetic correlations for acetylides and alcohols,
J. Phys. Chem. A, 1999, 103, 46, 9163-9166, https://doi.org/10.1021/jp992852v
. [all data]