2-carboxy-4-hydroxy-phenoxide anion

Reaction thermochemistry data

Data compiled by: John E. Bartmess

Individual Reactions

C7H5O4- + Hydrogen cation = Gentisic acid

By formula: C7H5O4- + H+ = C5H11NO2

Quantity Value Units Method Reference Comment
Δr1329. ± 11.kJ/molIMRBBreuker, Knochenmuss, et al., 1999gas phase; Acid: 2,5-dihydroxy benzoic acid

References

Breuker, Knochenmuss, et al., 1999
Breuker, K.; Knochenmuss, R.; Zenobi, R., Gas-phase basicities of deprotonated matrix-assisted laser desorption/ionization matrix molecules, Int. J. Mass Spectrom., 1999, 184, 1, 25-38, https://doi.org/10.1016/S1387-3806(98)14200-8 . [all data]