(Xe)12..I anion
- Formula: IXe12-
- Molecular weight: 1702.421

Ion clustering data

Data compiled by: John E. Bartmess
Clustering reactions
IXe11- + 12 = IXe12-
By formula: IXe11- + 12Xe = IXe12-
Quantity | Value | Units | Method | Reference | Comment |
---|---|---|---|---|---|
ΔrH° | 3.8 ± 3.8 | kJ/mol | N/A | Becker, Markovich, et al., 1997 | gas phase; Stated electron affinity is the Vertical Detachment Energy |

Gas phase ion energetics data

Data compiled by: John E. Bartmess

Electron affinity of neutral species

EAneutral (eV) Method Reference Comment
3.6750 ± 0.0080LPESPivonka, Lenzer, et al., 2001Vertical Detachment Energy:3.692±0.008 eV
3.730 ± 0.020LPESBecker, Markovich, et al., 1997Stated electron affinity is the Vertical Detachment Energy

Reaction thermochemistry data

Data compiled by: John E. Bartmess

Individual Reactions

IXe11- + 12Xenon = IXe12-

By formula: IXe11- + 12Xe = IXe12-

Quantity Value Units Method Reference Comment
Δr0.90 ± 0.90kcal/molN/ABecker, Markovich, et al., 1997gas phase; Stated electron affinity is the Vertical Detachment Energy

References

Becker, Markovich, et al., 1997
Becker, I.; Markovich, G.; Chesnovsky, O.,
Bound Delocalized Excited States in I-Xen Clusters.,
Phys. Rev. Lett., 1997, 79, 18, 3391, https://doi.org/10.1103/PhysRevLett.79.3391
. [all data]