(Xe)11..I anion
- Formula: IXe11-
- Molecular weight: 1571.128

Gas phase ion energetics data

Data compiled by: John E. Bartmess
Electron affinity of neutral species
EAneutral (eV) | Method | Reference | Comment |
---|---|---|---|
3.6350 ± 0.0080 | LPES | Pivonka, Lenzer, et al., 2001 | Vertical Detachment Energy:3.651±0.008 eV |
3.690 ± 0.020 | LPES | Becker, Markovich, et al., 1997 | Stated electron affinity is the Vertical Detachment Energy |

References

Pivonka, Lenzer, et al., 2001
Pivonka, N.L.; Lenzer, T.; Furlanetto, M.R.; Neumark, D.M.,
Photoelectron spectroscopy of XenI- clusters (n = 13),
Chem. Phys., 2001, 334, 24-30. [all data]
Becker, Markovich, et al., 1997
Becker, I.; Markovich, G.; Chesnovsky, O.,
Bound Delocalized Excited States in I-Xen Clusters.,
Phys. Rev. Lett., 1997, 79, 18, 3391, https://doi.org/10.1103/PhysRevLett.79.3391
. [all data]